BDBM50036678 3-(3-Benzylsulfanylmethyl-4-hydroxy-5-methoxy-phenyl)-2-(3,4-dihydroxy-benzoyl)-acrylonitrile::CHEMBL116547
SMILES COc1cc(\C=C(/C#N)C(=O)c2ccc(O)c(O)c2)cc(CSCc2ccccc2)c1O
InChI Key InChIKey=SMPHSAOFBCCNMS-DJKKODMXSA-N
Data  4 IC50
  Tab Delimited (TSV)   2D SDfile   Computed 3D by Vconf -m prep SDfile
Find this compound or compounds like it in BindingDB:
Activity Spreadsheet -- Enzyme Inhibition Constant Data from BindingDB
Found 1 hit for monomerid = 50036678
TargetEpidermal growth factor receptor/Receptor tyrosine-protein kinase erbB-2(Homo sapiens (Human))
Hebrew University Of Jerusalem
Curated by ChEMBL
LigandPNGBDBM50036678(3-(3-Benzylsulfanylmethyl-4-hydroxy-5-methoxy-phen...)
Affinity DataIC50:  6.20E+3nM. Assay description: Inhibition of HER-14 (human EGFR overexpressing NIH3T3) cell proliferation
In DepthDetails ArticlePubMed